shepherd-v
type: LexicalEntry
canonical form: shepherd
sense: 02555865-v
part of speech: verb

02555865-v
type: LexicalConcept
in scheme: en-word.net
definition: watch over like a shepherd, as a teacher of their pupils
ili: i34445
lexfile: verb.social
part of speech: verb
hypernym: 01131763-v