neutralize-v
type: LexicalEntry
canonical form: neutralize
sense: 02541562-v
part of speech: verb

02541562-v
type: LexicalConcept
in scheme: en-word.net
definition: make politically neutral and thus inoffensive
example: The treaty neutralized the small republic
ili: i34382
lexfile: verb.social
part of speech: verb
hypernym: 00126072-v