screen-v
type: LexicalEntry
canonical form: screen
sense: 02538775-v
part of speech: verb

test-v
type: LexicalEntry
canonical form: test
sense: 02538775-v
part of speech: verb

02538775-v
type: LexicalConcept
in scheme: en-word.net
definition: test or examine for the presence of disease or infection
example: screen the blood for the HIV virus
ili: i34366
lexfile: verb.social
part of speech: verb
hypernym: 02538948-v