begin-v
type: LexicalEntry
canonical form: begin
sense: 02532175-v
part of speech: verb

02532175-v
type: LexicalConcept
in scheme: en-word.net
definition: achieve or accomplish in the least degree, usually used in the negative
example: This economic measure doesn't even begin to deal with the problem of inflation
example: You cannot even begin to understand the problem we had to deal with during the war
ili: i34339
lexfile: verb.social
part of speech: verb
hypernym: 02531751-v