pass-v
type: LexicalEntry
canonical form: pass
sense: 02530710-v
part of speech: verb

make it-v
type: LexicalEntry
canonical form: make it
sense: 02530710-v
part of speech: verb

02530710-v
type: LexicalConcept
in scheme: en-word.net
definition: go successfully through a test or a selection process
example: She passed the new Jersey Bar Exam and can practice law now
ili: i34333
lexfile: verb.social
part of speech: verb
hypernym: 02529837-v