pose-v
type: LexicalEntry
canonical form: pose
sense: 02524849-v
part of speech: verb

posture-v
type: LexicalEntry
canonical form: posture
sense: 02524849-v
part of speech: verb

02524849-v
type: LexicalConcept
in scheme: en-word.net
definition: behave affectedly or unnaturally in order to impress others
example: Don't pay any attention to him — he is always posing to impress his peers!
example: She postured and made a total fool of herself
ili: i34309
lexfile: verb.social
part of speech: verb
hypernym: 00010428-v