banish-v
type: LexicalEntry
canonical form: banish
sense: 02509929-v
part of speech: verb

ban-v
type: LexicalEntry
canonical form: ban
sense: 02509929-v
part of speech: verb

02509929-v
type: LexicalConcept
in scheme: en-word.net
definition: ban from a place of residence, as for punishment
ili: i34237
lexfile: verb.social
part of speech: verb
hypernym: 02507387-v