legitimate-a
type: LexicalEntry
canonical form: legitimate
sense: 02509114-s
part of speech: adjective

logical-a
type: LexicalEntry
canonical form: logical
sense: 02509114-s
part of speech: adjective

02509114-s
type: LexicalConcept
in scheme: en-word.net
definition: based on known statements or events or conditions
example: rain was a logical expectation, given the time of year
ili: i13861
lexfile: adj.all
part of speech: adjective satellite
similar: https://en-word.net/synset/02508521-a