confine-v
type: LexicalEntry
canonical form: confine
sense: 02500687-v
part of speech: verb

detain-v
type: LexicalEntry
canonical form: detain
sense: 02500687-v
part of speech: verb

02500687-v
type: LexicalConcept
in scheme: en-word.net
definition: deprive of freedom; take into confinement
ili: i34195
lexfile: verb.social
part of speech: verb
hypernym: 02372362-v