free-v
type: LexicalEntry
canonical form: free
sense: 02499696-v
part of speech: verb

release-v
type: LexicalEntry
canonical form: release
sense: 02499696-v
part of speech: verb

02499696-v
type: LexicalConcept
in scheme: en-word.net
definition: make (information) available for publication
example: release the list with the names of the prisoners
ili: i34191
lexfile: verb.social
part of speech: verb
hypernym: 02484912-v