burn-v
type: LexicalEntry
canonical form: burn
sense: 02490911-v
part of speech: verb

02490911-v
type: LexicalConcept
in scheme: en-word.net
definition: execute by tying to a stake and setting alight
example: Witches were burned in Salem
ili: i34146
lexfile: verb.social
part of speech: verb
entails: 00379335-v
hypernym: 02488856-v