monkey-n
type: LexicalEntry
canonical form: monkey
sense: 02486953-n
part of speech: noun

02486953-n
type: LexicalConcept
in scheme: en-word.net
definition: any of various long-tailed primates (excluding the prosimians)
ili: i48720
lexfile: noun.animal
part of speech: noun
hypernym: 02472545-n