recall-v
type: LexicalEntry
canonical form: recall
sense: 02485805-v
part of speech: verb

02485805-v
type: LexicalConcept
in scheme: en-word.net
definition: make unavailable; bar from sale or distribution
example: The company recalled the product when it was found to be faulty
ili: i34120
lexfile: verb.social
part of speech: verb
hypernym: 02482757-v