create-v
type: LexicalEntry
canonical form: create
sense: 02481808-v
part of speech: verb

02481808-v
type: LexicalConcept
in scheme: en-word.net
definition: invest with a new title, office, or rank
example: Create one a peer
ili: i34101
lexfile: verb.social
part of speech: verb
hypernym: 02481345-v