consociate-v
type: LexicalEntry
canonical form: consociate
sense: 02475598-v
part of speech: verb

associate-v
type: LexicalEntry
canonical form: associate
sense: 02475598-v
part of speech: verb

02475598-v
type: LexicalConcept
in scheme: en-word.net
definition: bring or come into association or action
example: The churches consociated to fight their dissolution
ili: i34070
lexfile: verb.social
part of speech: verb
hypernym: 02475258-v