lot-v
type: LexicalEntry
canonical form: lot
sense: 02474388-v
part of speech: verb

02474388-v
type: LexicalConcept
in scheme: en-word.net
definition: divide into lots, as of land, for example
ili: i34063
lexfile: verb.social
part of speech: verb
hypernym: 02473085-v