sucker-n
type: LexicalEntry
canonical form: sucker
sense: 02468045-n
part of speech: noun

02468045-n
type: LexicalConcept
in scheme: en-word.net
definition: an organ specialized for sucking nourishment or for adhering to objects by suction
ili: i48619
lexfile: noun.animal
part of speech: noun
hypernym: 05305022-n