prevent-v
type: LexicalEntry
canonical form: prevent
sense: 02455370-v
part of speech: verb

keep-v
type: LexicalEntry
canonical form: keep
sense: 02455370-v
part of speech: verb

02455370-v
type: LexicalConcept
in scheme: en-word.net
definition: stop (someone or something) from doing something or being in a certain state
example: We must prevent the cancer from spreading
example: His snoring kept me from falling asleep
example: Keep the child from eating the marbles
ili: i33977
lexfile: verb.social
part of speech: verb
hypernym: 02372362-v
similar: 01304679-v