draw up-v
type: LexicalEntry
canonical form: draw up
sense: 02453599-v
part of speech: verb

02453599-v
type: LexicalConcept
in scheme: en-word.net
definition: form or arrange in order or formation, as of a body of soldiers
ili: i33968
lexfile: verb.social
part of speech: verb
hypernym: 02453050-v