specialize-v
type: LexicalEntry
canonical form: specialize
sense: 02451029-v
part of speech: verb

specialise-v
type: LexicalEntry
canonical form: specialise
sense: 02451029-v
part of speech: verb

02451029-v
type: LexicalConcept
in scheme: en-word.net
definition: devote oneself to a special area of work
example: She specializes in honey bees
example: This baker specializes in French bread
ili: i33954
lexfile: verb.social
part of speech: verb
hypernym: 02418610-v