operate-v
type: LexicalEntry
canonical form: operate
sense: 02448714-v
part of speech: verb

run-v
type: LexicalEntry
canonical form: run
sense: 02448714-v
part of speech: verb

02448714-v
type: LexicalConcept
in scheme: en-word.net
definition: direct or control; projects, businesses, etc.
example: She is running a relief operation in the Sudan
ili: i33943
lexfile: verb.social
part of speech: verb
hypernym: 02444366-v