hold-v
type: LexicalEntry
canonical form: hold
sense: 02446762-v
part of speech: verb

02446762-v
type: LexicalConcept
in scheme: en-word.net
definition: take and maintain control over, often by violent means
example: The dissatisfied students held the President's office for almost a week
ili: i33933
lexfile: verb.social
part of speech: verb
hypernym: 02445887-v
similar: 01132302-v