guide-v
type: LexicalEntry
canonical form: guide
sense: 02444597-v
part of speech: verb

steer-v
type: LexicalEntry
canonical form: steer
sense: 02444597-v
part of speech: verb

02444597-v
type: LexicalConcept
in scheme: en-word.net
definition: be a guiding or motivating force or drive
example: The teacher steered the gifted students towards the more challenging courses
ili: i33924
lexfile: verb.social
part of speech: verb
hypernym: 02444366-v