close-v
type: LexicalEntry
canonical form: close
sense: 02430760-v
part of speech: verb

02430760-v
type: LexicalConcept
in scheme: en-word.net
definition: finish or terminate (meetings, speeches, etc.)
example: The meeting was closed with a charge by the chairman of the board
ili: i33863
lexfile: verb.social
part of speech: verb
hypernym: 00353480-v