quench-v
type: LexicalEntry
canonical form: quench
sense: 02427763-v
part of speech: verb

02427763-v
type: LexicalConcept
in scheme: en-word.net
definition: suppress (sparking) when the current is cut off in an inductive circuit, or suppress (an oscillation or discharge) in a component or device
ili: i33849
lexfile: verb.social
part of speech: verb
hypernym: 00463047-v