play-v
type: LexicalEntry
canonical form: play
sense: 02423786-v
part of speech: verb

02423786-v
type: LexicalConcept
in scheme: en-word.net
definition: be at play; be engaged in playful activity; amuse oneself in a way characteristic of children
example: The kids were playing outside all day
example: I used to play with trucks as a little girl
ili: i33829
lexfile: verb.social
part of speech: verb
hypernym: 02372362-v
similar: 02423521-v