chamois-n
type: LexicalEntry
canonical form: chamois
sense: 02421982-n
part of speech: noun

Rupicapra rupicapra-n
type: LexicalEntry
canonical form: Rupicapra rupicapra
sense: 02421982-n
part of speech: noun

02421982-n
type: LexicalConcept
in scheme: en-word.net
definition: hoofed mammal of mountains of Eurasia having upright horns with backward-hooked tips
ili: i48344
lexfile: noun.animal
part of speech: noun
hypernym: 02420710-n