work-v
type: LexicalEntry
canonical form: work
sense: 02418610-v
part of speech: verb

02418610-v
type: LexicalConcept
in scheme: en-word.net
definition: exert oneself by doing mental or physical work for a purpose or out of necessity; work
example: I will work hard to improve my grades
example: she worked hard for better living conditions for the poor
ili: i33807
lexfile: verb.social
part of speech: verb
hypernym: 02376902-v
similar: 02415985-v