take off-v
type: LexicalEntry
canonical form: take off
sense: 02417080-v
part of speech: verb

take time off-v
type: LexicalEntry
canonical form: take time off
sense: 02417080-v
part of speech: verb

02417080-v
type: LexicalConcept
in scheme: en-word.net
definition: take time off from work; stop working temporarily
ili: i33798
lexfile: verb.social
part of speech: verb
hypernym: 00780320-v