clerk-v
type: LexicalEntry
canonical form: clerk
sense: 02416932-v
part of speech: verb

02416932-v
type: LexicalConcept
in scheme: en-word.net
definition: work as a clerk, as in the legal business
ili: i33797
lexfile: verb.social
part of speech: verb
hypernym: 02418610-v