alternate-v
type: LexicalEntry
canonical form: alternate
sense: 02398868-v
part of speech: verb

02398868-v
type: LexicalConcept
in scheme: en-word.net
definition: exchange people temporarily to fulfill certain jobs and functions
ili: i33716
lexfile: verb.social
part of speech: verb
hypernym: 02398631-v