nonstarter-n
type: LexicalEntry
canonical form: nonstarter
sense: 02388428-n
part of speech: noun

02388428-n
type: LexicalConcept
in scheme: en-word.net
definition: a horse that fails to run in a race for which it has been entered
ili: i48134
lexfile: noun.animal
part of speech: noun
hypernym: 02385600-n