pony-n
type: LexicalEntry
canonical form: pony
sense: 02385089-n
part of speech: noun

02385089-n
type: LexicalConcept
in scheme: en-word.net
definition: any of various breeds of small gentle horses usually less than five feet high at the shoulder
ili: i48108
lexfile: noun.animal
part of speech: noun
hypernym: 02377103-n