combine-v
type: LexicalEntry
canonical form: combine
sense: 02383029-v
part of speech: verb

02383029-v
type: LexicalConcept
in scheme: en-word.net
definition: join for a common purpose or in a common action
example: These forces combined with others
ili: i33646
lexfile: verb.social
part of speech: verb
hypernym: 02382049-v