pony-n
type: LexicalEntry
canonical form: pony
sense: 02382987-n
part of speech: noun

02382987-n
type: LexicalConcept
in scheme: en-word.net
definition: a range horse of the western United States
ili: i48091
lexfile: noun.animal
part of speech: noun
hypernym: 02377103-n