race-v
type: LexicalEntry
canonical form: race
sense: 02374947-v
part of speech: verb

02374947-v
type: LexicalConcept
in scheme: en-word.net
definition: to work as fast as possible towards a goal, sometimes in competition with others
example: We are racing to find a cure for AIDS
ili: i33608
lexfile: verb.social
part of speech: verb
hypernym: 02372362-v