ungulate-n
type: LexicalEntry
canonical form: ungulate
sense: 02373458-n
part of speech: noun

hoofed mammal-n
type: LexicalEntry
canonical form: hoofed mammal
sense: 02373458-n
part of speech: noun

02373458-n
type: LexicalConcept
in scheme: en-word.net
definition: any of a number of mammals with hooves that are superficially similar but not necessarily closely related taxonomically
ili: i48036
lexfile: noun.animal
part of speech: noun
hypernym: 01889397-n
mero part: 02156611-n
mero part: 02465459-n
mero part: 02465836-n