vest-v
type: LexicalEntry
canonical form: vest
sense: 02367915-v
part of speech: verb

02367915-v
type: LexicalConcept
in scheme: en-word.net
definition: place (authority, property, or rights) in the control of a person or group of persons
example: She vested her vast fortune in her two sons
ili: i33569
lexfile: verb.possession
part of speech: verb
hypernym: 02204104-v
similar: 02226961-v