tap-v
type: LexicalEntry
canonical form: tap
sense: 02365273-v
part of speech: verb

02365273-v
type: LexicalConcept
in scheme: en-word.net
definition: furnish with a tap or spout, so as to be able to draw liquid from it
example: tap a cask of wine
ili: i33554
lexfile: verb.possession
part of speech: verb
hypernym: 02332196-v
similar: 01616636-v
similar: 01858505-v