close out-v
type: LexicalEntry
canonical form: close out
sense: 02357534-v
part of speech: verb

02357534-v
type: LexicalConcept
in scheme: en-word.net
definition: terminate by selling off or disposing of
example: He closed out his line of sports cars
ili: i33506
lexfile: verb.possession
part of speech: verb
hypernym: 02227100-v