sacrifice-v
type: LexicalEntry
canonical form: sacrifice
sense: 02330554-v
part of speech: verb

02330554-v
type: LexicalConcept
in scheme: en-word.net
definition: make a sacrifice of; in religious rituals
ili: i33363
lexfile: verb.possession
part of speech: verb
hypernym: 02619522-v