strong-a
type: LexicalEntry
canonical form: strong
sense: https://en-word.net/lemma/strong-a#02328781-a
part of speech: adjective

https://en-word.net/synset/02328781-a
type: LexicalConcept
in scheme: en-word.net
definition: having strength or power greater than average or expected
example: a strong radio signal
example: strong medicine
example: a strong man
ili: i12857
lexfile: adj.all
part of speech: adjective
also: https://en-word.net/synset/01831389-a
also: https://en-word.net/synset/02045115-a
also: https://en-word.net/synset/00710810-a
also: https://en-word.net/synset/02456417-a
attribute: 05036872-n
similar: 02329347-s
similar: 02329474-s
similar: 02329581-s
similar: 02329929-s
similar: 02330020-s
similar: 02330163-s
similar: 02330284-s
similar: 02330476-s
similar: 02330657-s
similar: 02330844-s
similar: 02330976-s
similar: 02331139-s
similar: 02331344-s
similar: 02331435-s
similar: 02331532-s
similar: 02331714-s
similar: 02331874-s
similar: 90010201-s