aboveboard-a
type: LexicalEntry
canonical form: aboveboard
sense: 02326406-s
part of speech: adjective

straightforward-a
type: LexicalEntry
canonical form: straightforward
sense: 02326406-s
part of speech: adjective

02326406-s
type: LexicalConcept
in scheme: en-word.net
definition: without concealment or deception; honest
example: their business was open and aboveboard
example: straightforward in all his business affairs
ili: i12843
lexfile: adj.all
part of speech: adjective satellite
similar: https://en-word.net/synset/02326142-a