foot-n
type: LexicalEntry
canonical form: foot
sense: 02324865-n
part of speech: noun

invertebrate foot-n
type: LexicalEntry
canonical form: invertebrate foot
sense: 02324865-n
part of speech: noun

02324865-n
type: LexicalConcept
in scheme: en-word.net
definition: any of various organs of locomotion or attachment in invertebrates
ili: i47756
lexfile: noun.animal
part of speech: noun
hypernym: 05305022-n