queen-n
type: LexicalEntry
canonical form: queen
sense: 02315660-n
part of speech: noun

02315660-n
type: LexicalConcept
in scheme: en-word.net
definition: the only fertile female in a colony of social insects such as bees and ants and termites; its function is to lay eggs
ili: i47704
lexfile: noun.animal
part of speech: noun
hypernym: 02162607-n