feed back-v
type: LexicalEntry
canonical form: feed back
sense: 02315137-v
part of speech: verb

resubmit-v
type: LexicalEntry
canonical form: resubmit
sense: 02315137-v
part of speech: verb

02315137-v
type: LexicalConcept
in scheme: en-word.net
definition: submit (information) again to a program or automatic system
ili: i33283
lexfile: verb.possession
part of speech: verb
hypernym: 02314987-v