uneven-a
type: LexicalEntry
canonical form: uneven
sense: 02313332-s
part of speech: adjective

02313332-s
type: LexicalConcept
in scheme: en-word.net
definition: variable and recurring at irregular intervals
example: an uneven gait
example: uneven spacing
ili: i12766
lexfile: adj.all
part of speech: adjective satellite
similar: https://en-word.net/synset/02310758-a