full-a
type: LexicalEntry
canonical form: full
sense: 02308182-s
part of speech: adjective

replete-a
type: LexicalEntry
canonical form: replete
sense: 02308182-s
part of speech: adjective

02308182-s
type: LexicalConcept
in scheme: en-word.net
definition: filled to satisfaction with food or drink
example: a full stomach
ili: i12736
lexfile: adj.all
part of speech: adjective satellite
similar: https://en-word.net/synset/02307908-a