abrupt-a
type: LexicalEntry
canonical form: abrupt
sense: 02301854-s
part of speech: adjective

disconnected-a
type: LexicalEntry
canonical form: disconnected
sense: 02301854-s
part of speech: adjective

02301854-s
type: LexicalConcept
in scheme: en-word.net
definition: marked by sudden changes in subject and sharp transitions
example: abrupt prose
ili: i12699
lexfile: adj.all
part of speech: adjective satellite
similar: https://en-word.net/synset/02301588-a