clean up-v
type: LexicalEntry
canonical form: clean up
sense: 02284160-v
part of speech: verb

02284160-v
type: LexicalConcept
in scheme: en-word.net
definition: make a big profit; often in a short period of time
example: The investor really cleaned up when the stock market went up
ili: i33130
lexfile: verb.possession
part of speech: verb
hypernym: 02283675-v